Target
Amiloride-sensitive amine oxidase [copper-containing]
Ligand
BDBM50046204
Substrate
Meas. Tech.
ChEBML_53893
IC50
12900±n/a nM
Citation
 Stanek, JCaravatti, GCapraro, HGFuret, PMett, HSchneider, PRegenass, U S-adenosylmethionine decarboxylase inhibitors: new aryl and heteroaryl analogues of methylglyoxal bis(guanylhydrazone). J Med Chem 36:46-54 (1993)  
Target
Name:
Amiloride-sensitive amine oxidase [copper-containing]
Synonyms:
ABP Abp1 Aoc1 Diamine oxidase | Histaminase
Type:
PROTEIN
Mol. Mass.:
85028.72
Organism:
Rattus norvegicus
Description:
ChEMBL_53893
Residue:
746
  
Inhibitor
Name:
BDBM50046204
Synonyms:
4,4'-bipyridine-2,2'-dicarboximidamide | CHEMBL433513
Type:
Small organic molecule
Emp. Form.:
C12H12N6
Mol. Mass.:
240.2639
SMILES:
NC(=N)c1cc(ccn1)-c1ccnc(c1)C(N)=N
: