Target
S-adenosylmethionine decarboxylase proenzyme
Ligand
BDBM50046200
Substrate
Meas. Tech.
ChEBML_197689
IC50
66.0±n/a nM
Citation
 Stanek, JCaravatti, GCapraro, HGFuret, PMett, HSchneider, PRegenass, U S-adenosylmethionine decarboxylase inhibitors: new aryl and heteroaryl analogues of methylglyoxal bis(guanylhydrazone). J Med Chem 36:46-54 (1993)  
Target
Name:
S-adenosylmethionine decarboxylase proenzyme
Synonyms:
Amd1 S-adenosylmethionine decarboxylase 1
Type:
PROTEIN
Mol. Mass.:
38134.93
Organism:
Rattus norvegicus
Description:
ChEMBL_197052
Residue:
333
  
Inhibitor
Name:
BDBM50046200
Synonyms:
(2E)-2-(1-{3-[(E)-amino(imino)methyl]phenyl}ethylidene)hydrazinecarboximidamide | CHEMBL150828
Type:
Small organic molecule
Emp. Form.:
C10H14N6
Mol. Mass.:
218.2584
SMILES:
[#6]-[#6](=[#7]\[#7]=[#6](\[#7])-[#7])-c1cccc(c1)-[#6](-[#7])=[#7]
: