Target
S-adenosylmethionine decarboxylase proenzyme
Ligand
BDBM50046190
Substrate
Meas. Tech.
ChEBML_197689
IC50
84.0±n/a nM
Citation
 Stanek, JCaravatti, GCapraro, HGFuret, PMett, HSchneider, PRegenass, U S-adenosylmethionine decarboxylase inhibitors: new aryl and heteroaryl analogues of methylglyoxal bis(guanylhydrazone). J Med Chem 36:46-54 (1993)  
Target
Name:
S-adenosylmethionine decarboxylase proenzyme
Synonyms:
Amd1 S-adenosylmethionine decarboxylase 1
Type:
PROTEIN
Mol. Mass.:
38134.93
Organism:
Rattus norvegicus
Description:
ChEMBL_197052
Residue:
333
  
Inhibitor
Name:
BDBM50046190
Synonyms:
6-((E)-{[(E)-amino(hydrazono)methyl]hydrazono}methyl)pyridine-2-carboximidamide | CHEMBL357754
Type:
Small organic molecule
Emp. Form.:
C8H12N8
Mol. Mass.:
220.2345
SMILES:
NN=C(N)c1cccc(C=NNC(N)=N)n1
: