Target
S-adenosylmethionine decarboxylase proenzyme
Ligand
BDBM50046211
Substrate
Meas. Tech.
ChEBML_197689
IC50
11000±n/a nM
Citation
 Stanek, JCaravatti, GCapraro, HGFuret, PMett, HSchneider, PRegenass, U S-adenosylmethionine decarboxylase inhibitors: new aryl and heteroaryl analogues of methylglyoxal bis(guanylhydrazone). J Med Chem 36:46-54 (1993)  
Target
Name:
S-adenosylmethionine decarboxylase proenzyme
Synonyms:
Amd1 S-adenosylmethionine decarboxylase 1
Type:
PROTEIN
Mol. Mass.:
38134.93
Organism:
Rattus norvegicus
Description:
ChEMBL_197052
Residue:
333
  
Inhibitor
Name:
BDBM50046211
Synonyms:
2-((E)-{[(E)-amino(imino)methyl]hydrazono}methyl)pyrimidine-4-carboximidamide | CHEMBL346440
Type:
Small organic molecule
Emp. Form.:
C7H10N8
Mol. Mass.:
206.2079
SMILES:
NC(=N)NN=Cc1nccc(n1)C(N)=N
: