Target
Amiloride-sensitive amine oxidase [copper-containing]
Ligand
BDBM50046206
Substrate
Meas. Tech.
ChEBML_53893
IC50
240000±n/a nM
Citation
 Stanek, JCaravatti, GCapraro, HGFuret, PMett, HSchneider, PRegenass, U S-adenosylmethionine decarboxylase inhibitors: new aryl and heteroaryl analogues of methylglyoxal bis(guanylhydrazone). J Med Chem 36:46-54 (1993)  
Target
Name:
Amiloride-sensitive amine oxidase [copper-containing]
Synonyms:
ABP Abp1 Aoc1 Diamine oxidase | Histaminase
Type:
PROTEIN
Mol. Mass.:
85028.72
Organism:
Rattus norvegicus
Description:
ChEMBL_53893
Residue:
746
  
Inhibitor
Name:
BDBM50046206
Synonyms:
2,2'-bipyridine-6,6'-dicarboximidamide | CHEMBL151197
Type:
Small organic molecule
Emp. Form.:
C12H12N6
Mol. Mass.:
240.2639
SMILES:
NC(=N)c1cccc(n1)-c1cccc(n1)C(N)=N
: