Target
Leukotriene A-4 hydrolase
Ligand
BDBM50046319
Substrate
Meas. Tech.
ChEMBL_96936 (CHEMBL706177)
IC50
3000±n/a nM
Citation
 Yuan, WMunoz, BWong, CHHaeggström, JZWetterholm, ASamuelsson, B Development of selective tight-binding inhibitors of leukotriene A4 hydrolase. J Med Chem 36:211-20 (1993)  
Target
Name:
Leukotriene A-4 hydrolase
Synonyms:
LKHA4_HUMAN LTA4 Leukotriene A(4) hydrolase Leukotriene A4 hydrolase
Type:
Hydrolase; metalloprotease
Mol. Mass.:
69280.41
Organism:
Homo sapiens (Human)
Description:
Human recombinant LTA4H.
Residue:
611
  
Inhibitor
Name:
BDBM50046319
Synonyms:
3-[2-Amino-3-(4-benzyloxy-phenyl)-propionyl]-benzoic acid | CHEMBL68958
Type:
Small organic molecule
Emp. Form.:
C23H21NO4
Mol. Mass.:
375.4171
SMILES:
N[C@@H](Cc1ccc(OCc2ccccc2)cc1)C(=O)c1cccc(c1)C(O)=O
: