Target
Prothrombin
Ligand
BDBM50046346
Substrate
Meas. Tech.
ChEBML_207947
EC50
880.0±n/a nM
Citation
 Balasubramanian, NSt Laurent, DRFederici, MEMeanwell, NAWright, JJSchumacher, WASeiler, SM Active site-directed synthetic thrombin inhibitors: synthesis, in vitro and in vivo activity profile of BMY 44621 and analogs. An examination of the role of the amino group in the D-Phe-Pro-Arg-H series. J Med Chem 36:300-3 (1993)  
Target
Name:
Prothrombin
Synonyms:
Activation peptide fragment 1 Coagulation factor II Prothrombin precursor Thrombin heavy chain | Thrombin light chain
Type:
Protein
Mol. Mass.:
70029.57
Organism:
Homo sapiens (Human)
Description:
P00734
Residue:
622
  
Inhibitor
Name:
BDBM50046346
Synonyms:
1-(2-Oxo-5-phenyl-pentanoyl)-pyrrolidine-2-carboxylic acid (1-formyl-4-guanidino-butyl)-amide | CHEMBL317224
Type:
Small organic molecule
Emp. Form.:
C22H31N5O4
Mol. Mass.:
429.5126
SMILES:
NC(=N)NCCCC(NC(=O)C1CCCN1C(=O)C(=O)CCCc1ccccc1)C=O
: