Target
Plasminogen
Ligand
BDBM50060000
Substrate
Meas. Tech.
ChEMBL_208045 (CHEMBL872635)
IC50
42000±n/a nM
Citation
 Shuman, RTRothenberger, RBCampbell, CSSmith, GFGifford-Moore, DSGesellchen, PD Highly selective tripeptide thrombin inhibitors. J Med Chem 36:314-9 (1993)  
Target
Name:
Plasminogen
Synonyms:
Activation peptide PLG Plasmin Plasmin heavy chain A, short form | Plasmin light chain B
Type:
Enzyme
Mol. Mass.:
90579.18
Organism:
Homo sapiens (Human)
Description:
Residue:
810
  
Inhibitor
Name:
BDBM50060000
Synonyms:
(S)-1-((R)-2-Methylamino-2-phenyl-acetyl)-pyrrolidine-2-carboxylic acid ((S)-1-formyl-4-guanidino-butyl)-amide | CHEMBL105205
Type:
Small organic molecule
Emp. Form.:
C20H30N6O3
Mol. Mass.:
402.4906
SMILES:
CN[C@@H](C(=O)N1CCC[C@H]1C(=O)N[C@@H](CCCNC(N)=N)C=O)c1ccccc1
: