Target
Plasminogen
Ligand
BDBM50046371
Substrate
Meas. Tech.
ChEMBL_208045 (CHEMBL872635)
IC50
860000±n/a nM
Citation
 Shuman, RTRothenberger, RBCampbell, CSSmith, GFGifford-Moore, DSGesellchen, PD Highly selective tripeptide thrombin inhibitors. J Med Chem 36:314-9 (1993)  
Target
Name:
Plasminogen
Synonyms:
Activation peptide PLG Plasmin Plasmin heavy chain A, short form | Plasmin light chain B
Type:
Enzyme
Mol. Mass.:
90579.18
Organism:
Homo sapiens (Human)
Description:
Residue:
810
  
Inhibitor
Name:
BDBM50046371
Synonyms:
1-(2-Methoxy-2-phenyl-acetyl)-pyrrolidine-2-carboxylic acid (1-formyl-4-guanidino-butyl)-amide | CHEMBL107598
Type:
Small organic molecule
Emp. Form.:
C20H29N5O4
Mol. Mass.:
403.4754
SMILES:
CO[C@H](C(=O)N1CCC[C@H]1C(=O)NC(CCCNC(N)=N)C=O)c1ccccc1
: