Target
Gag-Pol polyprotein [489-587]
Ligand
BDBM50014147
Substrate
Meas. Tech.
ChEMBL_159311 (CHEMBL769364)
IC50
3±n/a nM
Citation
 Kempf, DJCodacovi, LWang, XCKohlbrenner, WEWideburg, NESaldivar, AVasavanonda, SMarsh, KCBryant, PSham, HL Symmetry-based inhibitors of HIV protease. Structure-activity studies of acylated 2,4-diamino-1,5-diphenyl-3-hydroxypentane and 2,5-diamino-1,6-diphenylhexane-3,4-diol. J Med Chem 36:320-30 (1993)  
Target
Name:
Gag-Pol polyprotein [489-587]
Synonyms:
Human immunodeficiency virus type 1 protease Pol polyprotein | gag-pol
Type:
Enzyme Subunit
Mol. Mass.:
10781.16
Organism:
Human immunodeficiency virus type 1
Description:
P04585[489-587]
Residue:
99
  
Inhibitor
Name:
BDBM50014147
Synonyms:
A-74704 {(S)-1-[(1S,3S)-1-Benzyl-3-((R)-2-benzyloxycarbonylamino-3-methyl-butyrylamino)-2-hydroxy-4-phenyl-butylcarbamoyl]-2-methyl-propyl}-carbamic acid benzyl ester {1-[1-Benzyl-3-(2-benzyloxycarbonylamino-3-methyl-butyrylamino)-2-hydroxy-4-phenyl-butylcarbamoyl]-2-methyl-propyl}-carbamic acid benzyl ester
Type:
Small organic molecule
Emp. Form.:
C43H52N4O7
Mol. Mass.:
736.8956
SMILES:
CC(C)[C@H](NC(=O)OCc1ccccc1)C(=O)N[C@@H](Cc1ccccc1)[C@@H](O)[C@H](Cc1ccccc1)NC(=O)[C@H](NC(=O)OCc1ccccc1)C(C)C
: