Target
Thymidylate synthase
Ligand
BDBM50046660
Substrate
Meas. Tech.
ChEMBL_219325 (CHEMBL823518)
Ki
0.124±n/a nM
Citation
 Webber, SEBleckman, TMAttard, JDeal, JGKathardekar, VWelsh, KMWebber, SJanson, CAMatthews, DASmith, WW Design of thymidylate synthase inhibitors using protein crystal structures: the synthesis and biological evaluation of a novel class of 5-substituted quinazolinones. J Med Chem 36:733-46 (1993)  
Target
Name:
Thymidylate synthase
Synonyms:
TS TYMS Thymidylate synthase (TS) | Thymidylate synthase/GAR transformylase/AICAR transformylase
Type:
Enzyme
Mol. Mass.:
35718.07
Organism:
Homo sapiens (Human)
Description:
Residue:
313
  
Inhibitor
Name:
BDBM50046660
Synonyms:
2-[4-(2-Amino-6-methyl-4-oxo-3,4-dihydro-quinazolin-5-ylsulfanyl)-benzoylamino]-pentanedioic acid | CHEMBL166027
Type:
Small organic molecule
Emp. Form.:
C21H20N4O6S
Mol. Mass.:
456.472
SMILES:
Cc1ccc2nc(N)[nH]c(=O)c2c1Sc1ccc(cc1)C(=O)N[C@H](CCC(O)=O)C(O)=O
: