Target
Amine oxidase [flavin-containing] B
Ligand
BDBM50046769
Substrate
Meas. Tech.
ChEMBL_99763 (CHEMBL857621)
Ki
5790000±n/a nM
Citation
 Nishimura, KLu, XSilverman, RB Inactivation of monoamine oxidase B by analogues of the anticonvulsant agent milacemide (2-(n-pentylamino)acetamide). J Med Chem 36:446-8 (1993)  
Target
Name:
Amine oxidase [flavin-containing] B
Synonyms:
AOFB_BOVIN MAO-B Monoamine Oxidase Type B (MAO-B) Monoamine oxidase B | Monoamine oxidase type B
Type:
PROTEIN
Mol. Mass.:
58428.94
Organism:
Bos taurus
Description:
ChEMBL_1501478
Residue:
520
  
Inhibitor
Name:
BDBM50046769
Synonyms:
3-Pentylamino-propionitrile | CHEMBL139492
Type:
Small organic molecule
Emp. Form.:
C8H16N2
Mol. Mass.:
140.226
SMILES:
CCCCCNCCC#N
: