Target
Type-1 angiotensin II receptor
Ligand
BDBM50047134
Substrate
Meas. Tech.
ChEMBL_36780 (CHEMBL650301)
IC50
190±n/a nM
Citation
 Bradbury, RHAllott, CPDennis, MGirdwood, JAKenny, PWMajor, JSOldham, AARatcliffe, AHRivett, JERoberts, DA New nonpeptide angiotensin II receptor antagonists. 3. Synthesis, biological properties, and structure-activity relationships of 2-alkyl-4-(biphenylylmethoxy)pyridine derivatives. J Med Chem 36:1245-54 (1993)  
Target
Name:
Type-1 angiotensin II receptor
Synonyms:
AGTR1 AT1 | Angiotensin II type-1 receptor
Type:
PROTEIN
Mol. Mass.:
41004.19
Organism:
Cavia porcellus
Description:
ChEMBL_36783
Residue:
359
  
Inhibitor
Name:
BDBM50047134
Synonyms:
2,6-Dimethyl-4-[2'-(1H-tetrazol-5-yl)-biphenyl-4-ylmethoxy]-pyridine-3-carbaldehyde | CHEMBL22837
Type:
Small organic molecule
Emp. Form.:
C22H19N5O2
Mol. Mass.:
385.4186
SMILES:
Cc1cc(OCc2ccc(cc2)-c2ccccc2-c2nnn[nH]2)c(C=O)c(C)n1
: