Target
Adenosine receptor A2a/A2b
Ligand
BDBM50047189
Substrate
Meas. Tech.
ChEMBL_30723 (CHEMBL648802)
Ki
1100±n/a nM
Citation
 Jacobson, KAGallo-Rodriguez, CMelman, NFischer, BMaillard, Mvan Bergen, Avan Galen, PJKarton, Y Structure-activity relationships of 8-styrylxanthines as A2-selective adenosine antagonists. J Med Chem 36:1333-42 (1993)  
Target
Name:
Adenosine receptor A2a/A2b
Synonyms:
Adenosine A2 receptor
Type:
Mol. Mass.:
Description:
ASSAY_ID of ChEMBL is 30560
Components:
This complex has 2 components.
Component 1
Name:
Adenosine receptor A2b
Synonyms:
AA2BR_RAT Adora2b
Type:
PROTEIN
Mol. Mass.:
36378.84
Organism:
Rattus norvegicus
Description:
ChEMBL_32934
Residue:
332
  
Component 2
Name:
Adenosine receptor A2a
Synonyms:
AA2AR_RAT Adenosine A2 receptor Adenosine Receptors A2a (A2a) Adenosine receptors A2a Rat striatal adenosine A2a receptor
Type:
G Protein-Coupled Receptor (GPCR)
Mol. Mass.:
45015.65
Organism:
Rattus norvegicus (rat)
Description:
Rat A2A receptors expressed in CHO cells.
Residue:
410
  
Inhibitor
Name:
BDBM50047189
Synonyms:
8-[2-(3,4-Dimethoxy-phenyl)-vinyl]-1,3-dimethyl-3,7-dihydro-purine-2,6-dione | CHEMBL285589
Type:
Small organic molecule
Emp. Form.:
C17H18N4O4
Mol. Mass.:
342.3492
SMILES:
COc1ccc(C=Cc2nc3n(C)c(=O)n(C)c(=O)c3[nH]2)cc1OC
: