Target
Adenosine receptor A2a/A2b
Ligand
BDBM50006713
Substrate
Meas. Tech.
ChEMBL_30723 (CHEMBL648802)
Ki
44±n/a nM
Citation
 Jacobson, KAGallo-Rodriguez, CMelman, NFischer, BMaillard, Mvan Bergen, Avan Galen, PJKarton, Y Structure-activity relationships of 8-styrylxanthines as A2-selective adenosine antagonists. J Med Chem 36:1333-42 (1993)  
Target
Name:
Adenosine receptor A2a/A2b
Synonyms:
Adenosine A2 receptor
Type:
Mol. Mass.:
Description:
ASSAY_ID of ChEMBL is 30560
Components:
This complex has 2 components.
Component 1
Name:
Adenosine receptor A2b
Synonyms:
AA2BR_RAT Adora2b
Type:
PROTEIN
Mol. Mass.:
36378.84
Organism:
Rattus norvegicus
Description:
ChEMBL_32934
Residue:
332
  
Component 2
Name:
Adenosine receptor A2a
Synonyms:
AA2AR_RAT Adenosine A2 receptor Adenosine Receptors A2a (A2a) Adenosine receptors A2a Rat striatal adenosine A2a receptor
Type:
G Protein-Coupled Receptor (GPCR)
Mol. Mass.:
45015.65
Organism:
Rattus norvegicus (rat)
Description:
Rat A2A receptors expressed in CHO cells.
Residue:
410
  
Inhibitor
Name:
BDBM50006713
Synonyms:
1,3-Dipropyl-8-styryl-3,7-dihydro-purine-2,6-dione | CHEMBL283908
Type:
Small organic molecule
Emp. Form.:
C19H22N4O2
Mol. Mass.:
338.4036
SMILES:
CCCn1c2nc(C=Cc3ccccc3)[nH]c2c(=O)n(CCC)c1=O
: