Target
Adenosine receptor A2a/A2b
Ligand
BDBM50047159
Substrate
Meas. Tech.
ChEMBL_30723 (CHEMBL648802)
Ki
14±n/a nM
Citation
 Jacobson, KAGallo-Rodriguez, CMelman, NFischer, BMaillard, Mvan Bergen, Avan Galen, PJKarton, Y Structure-activity relationships of 8-styrylxanthines as A2-selective adenosine antagonists. J Med Chem 36:1333-42 (1993)  
Target
Name:
Adenosine receptor A2a/A2b
Synonyms:
Adenosine A2 receptor
Type:
Mol. Mass.:
Description:
ASSAY_ID of ChEMBL is 30560
Components:
This complex has 2 components.
Component 1
Name:
Adenosine receptor A2b
Synonyms:
AA2BR_RAT Adora2b
Type:
PROTEIN
Mol. Mass.:
36378.84
Organism:
Rattus norvegicus
Description:
ChEMBL_32934
Residue:
332
  
Component 2
Name:
Adenosine receptor A2a
Synonyms:
AA2AR_RAT Adenosine A2 receptor Adenosine Receptors A2a (A2a) Adenosine receptors A2a Rat striatal adenosine A2a receptor
Type:
G Protein-Coupled Receptor (GPCR)
Mol. Mass.:
45015.65
Organism:
Rattus norvegicus (rat)
Description:
Rat A2A receptors expressed in CHO cells.
Residue:
410
  
Inhibitor
Name:
BDBM50047159
Synonyms:
1,3-Dimethyl-7-phenethyl-8-[2-(3,4,5-trimethoxy-phenyl)-vinyl]-3,7-dihydro-purine-2,6-dione | CHEMBL283939
Type:
Small organic molecule
Emp. Form.:
C26H28N4O5
Mol. Mass.:
476.5243
SMILES:
COc1cc(\C=C\c2nc3n(C)c(=O)n(C)c(=O)c3n2CCc2ccccc2)cc(OC)c1OC
: