Target
Substance-P receptor
Ligand
BDBM50498569
Substrate
Meas. Tech.
ChEMBL_1512233 (CHEMBL3611629)
Ki
0.030000±n/a nM
Citation
 Nair, PYamamoto, TCowell, SKulkarni, VMoye, SNavratilova, EDavis, PMa, SWVanderah, TWLai, JPorreca, FHruby, VJ Discovery of tripeptide-derived multifunctional ligands possessing delta/mu opioid receptor agonist and neurokinin 1 receptor antagonist activities. Bioorg Med Chem Lett 25:3716-20 (2015)  
Target
Name:
Substance-P receptor
Synonyms:
NK-1 receptor NK1 Receptor NK1R_HUMAN Neurokinin-1 (NK-1) SPR TACR1 Tachykinin receptor 1 (NK1) | tachykinin
Type:
G Protein-Coupled Receptor (GPCR)
Mol. Mass.:
46254.43
Organism:
Homo sapiens (Human)
Description:
P25103
Residue:
407
  
Inhibitor
Name:
BDBM50498569
Synonyms:
CHEMBL3609617
Type:
Small organic molecule
Emp. Form.:
C34H33F6N5O6
Mol. Mass.:
721.6461
SMILES:
C[C@@H](NC(=O)[C@@H](N)Cc1ccc(O)cc1)C(=O)NCC(=O)N[C@@H](Cc1c[nH]c2ccccc12)C(=O)OCc1cc(cc(c1)C(F)(F)F)C(F)(F)F
: