Target
Adenosine receptor A1
Ligand
BDBM50001493
Substrate
Meas. Tech.
ChEBML_29287
Ki
60700±n/a nM
Citation
 Miyamoto, KYamamoto, YKurita, MSakai, RKonno, KSanae, FOhshima, TTakagi, KHasegawa, TIwasaki, N Bronchodilator activity of xanthine derivatives substituted with functional groups at the 1- or 7-position. J Med Chem 36:1380-6 (1993)  
Target
Name:
Adenosine receptor A1
Synonyms:
A1 adenosine receptor ADENOSINE A1 ADENOSINE A1 low Adenosine A1 receptor | Adenosine Receptor A1
Type:
Enzyme Catalytic Domain
Mol. Mass.:
36501.39
Organism:
GUINEA PIG
Description:
ADENOSINE A1 ADORA1 GUINEA PIG::P47745
Residue:
326
  
Inhibitor
Name:
BDBM50001493
Synonyms:
3-Propyl-3,7-dihydro-purine-2,6-dione 3-Propylxanthine (enprofylline) ENPROFYLLINE
Type:
Small organic molecule
Emp. Form.:
C8H10N4O2
Mol. Mass.:
194.1906
SMILES:
CCCn1c2nc[nH]c2c(=O)[nH]c1=O
: