Target
D(2) dopamine receptor
Ligand
BDBM50046465
Substrate
Meas. Tech.
ChEBML_62225
Ki
769.0±n/a nM
Citation
 Mewshaw, RESilverman, LSMathew, RMKaiser, CSherrill, RGCheng, MTiffany, CWKarbon, EWBailey, MABorosky, SA Bridged gamma-carbolines and derivatives possessing selective and combined affinity for 5-HT2 and D2 receptors. J Med Chem 36:1488-95 (1993)  
Target
Name:
D(2) dopamine receptor
Synonyms:
DOPAMINE D2 DOPAMINE D2 Short Dopamine D2 receptor Drd2
Type:
G Protein-Coupled Receptor (GPCR)
Mol. Mass.:
50931.60
Organism:
Rattus norvegicus (rat)
Description:
P61169
Residue:
444
  
Inhibitor
Name:
BDBM50046465
Synonyms:
1-[5-fluoro-9,15-diazatetracyclo[10.2.1.02,10.03,8]pentadeca-2(10),3,5,7-tetraen-15-yl]-4-phenylbutane | CHEMBL35711
Type:
Small organic molecule
Emp. Form.:
C23H25FN2
Mol. Mass.:
348.4564
SMILES:
Fc1ccc2[nH]c3CC4CCC(N4CCCCc4ccccc4)c3c2c1
: