Target
Protease
Ligand
BDBM50498809
Substrate
Meas. Tech.
ChEMBL_1523253 (CHEMBL3632388)
Ki
5.1±n/a nM
Citation
 Ghosh, AKTakayama, JKassekert, LAElla-Menye, JRYashchuk, SAgniswamy, JWang, YFAoki, MAmano, MWeber, ITMitsuya, H Structure-based design, synthesis, X-ray studies, and biological evaluation of novel HIV-1 protease inhibitors containing isophthalamide-derived P2-ligands. Bioorg Med Chem Lett 25:4903-4909 (2015)  
Target
Name:
Protease
Synonyms:
Type:
Enzyme
Mol. Mass.:
10904.79
Organism:
Human immunodeficiency virus 1 (HIV-1)
Description:
Q9YQ12
Residue:
99
  
Inhibitor
Name:
BDBM50498809
Synonyms:
CHEMBL3627852
Type:
Small organic molecule
Emp. Form.:
C33H43N3O6S
Mol. Mass.:
609.776
SMILES:
CCCN(C)C(=O)c1cccc(c1)C(=O)N[C@@H](Cc1ccccc1)[C@H](O)CN(CC(C)C)S(=O)(=O)c1ccc(OC)cc1
: