Target
Platelet-activating factor receptor
Ligand
BDBM50005232
Substrate
Meas. Tech.
ChEMBL_221702 (CHEMBL823402)
IC50
20±n/a nM
Citation
 Trova, MPWissner, ACarroll, MLKerwar, SSPickett, WCSchaub, RETorley, LWKohler, CA Analogues of platelet activating factor. 8. Antagonists of PAF containing an aromatic ring linked to a pyridinium ring. J Med Chem 36:580-90 (1993)  
Target
Name:
Platelet-activating factor receptor
Synonyms:
PAF-R PTAFR_CAVPO Platelet-activating factor receptor
Type:
Protein
Mol. Mass.:
39005.63
Organism:
Cavia porcellus
Description:
Residue:
342
  
Inhibitor
Name:
BDBM50005232
Synonyms:
(R)-2-{[Acetyl-(2-methoxy-3-octadecylcarbamoyloxy-propoxycarbonyl)-amino]-methyl}-1-ethyl-pyridinium; chloride 2-{[Acetyl-(2-methoxy-3-octadecylcarbamoyloxy-propoxycarbonyl)-amino]-methyl}-1-ethyl-pyridinium; chloride CHEMBL274420 | CV-6209
Type:
Small organic molecule
Emp. Form.:
C34H60N3O6
Mol. Mass.:
606.8562
SMILES:
(=O)OCC(COC(=O)N(Cc1cccc[n+]1CC)C(C)=O)OC
: