Target
Type-2 angiotensin II receptor
Ligand
BDBM50048114
Substrate
Meas. Tech.
ChEBML_35279
IC50
0.470000±n/a nM
Citation
 Plucinska, KKataoka, TYodo, MCody, WLHe, JXHumblet, CLu, GHLunney, EMajor, TCPanek, RL Multiple binding modes for the receptor-bound conformations of cyclic AII agonists. J Med Chem 36:1902-13 (1993)  
Target
Name:
Type-2 angiotensin II receptor
Synonyms:
AGTR2 AT2 Angiotensin II type 2 (AT-2) receptor Type-2 angiotensin II receptor
Type:
Enzyme Catalytic Domain
Mol. Mass.:
41201.61
Organism:
Homo sapiens (Human)
Description:
Angiotensin II, central 0 0::P50052
Residue:
363
  
Inhibitor
Name:
BDBM50048114
Synonyms:
CHEMBL384352 | c[Sar1-Arg2-Mpt3-Tyr4-Hcy5-His6-Pro7-Cys8]antiparallel
Type:
Small organic molecule
Emp. Form.:
C47H63N13O10S2
Mol. Mass.:
1034.214
SMILES:
CNCC(=O)N[C@@H](CCCNC(N)=N)C(=O)N1C[C@H]2C[C@H]1C(=O)N[C@@H](Cc1ccc(O)cc1)C(=O)N[C@@H](CCSS2)C(=O)N[C@@H](Cc1cnc[nH]1)C(=O)N1CCC[C@H]1C(=O)N[C@@H](Cc1ccccc1)C(O)=O
: