Target
Retinoic acid receptor alpha
Ligand
BDBM50048285
Substrate
Meas. Tech.
ChEMBL_197413 (CHEMBL799802)
Ki
420±n/a nM
Citation
 Charpentier, BBernardon, JMEustache, JMillois, CMartin, BMichel, SShroot, B Synthesis, structure-affinity relationships, and biological activities of ligands binding to retinoic acid receptor subtypes. J Med Chem 38:4993-5006 (1996)  
Target
Name:
Retinoic acid receptor alpha
Synonyms:
NR1B1 RAR-alpha RARA_HUMAN Retinoic acid receptor alpha/Retinoid X receptor alpha Retinoid receptor
Type:
PROTEIN
Mol. Mass.:
50778.87
Organism:
Homo sapiens (Human)
Description:
ChEMBL_1466191
Residue:
462
  
Inhibitor
Name:
BDBM50048285
Synonyms:
4-{(E)-2-[4-Methoxy-3-(1-methyl-cyclohexyl)-phenyl]-propenyl}-benzoic acid | CHEMBL356326
Type:
Small organic molecule
Emp. Form.:
C24H28O3
Mol. Mass.:
364.4773
SMILES:
COc1ccc(cc1C1(C)CCCCC1)C(\C)=C\c1ccc(cc1)C(O)=O
: