Target
Retinoic acid receptor gamma
Ligand
BDBM50048277
Substrate
Meas. Tech.
ChEMBL_196012 (CHEMBL798022)
Ki
95±n/a nM
Citation
 Charpentier, BBernardon, JMEustache, JMillois, CMartin, BMichel, SShroot, B Synthesis, structure-affinity relationships, and biological activities of ligands binding to retinoic acid receptor subtypes. J Med Chem 38:4993-5006 (1996)  
Target
Name:
Retinoic acid receptor gamma
Synonyms:
NR1B3 RAR-gamma RARG_HUMAN Retinoic acid receptor gamma | Retinoid receptor
Type:
PROTEIN
Mol. Mass.:
50345.43
Organism:
Homo sapiens (Human)
Description:
ChEMBL_1458016
Residue:
454
  
Inhibitor
Name:
BDBM50048277
Synonyms:
4-[(E)-2-(3-Adamantan-1-yl-4-methoxy-phenyl)-propenyl]-benzoic acid | CHEMBL146449
Type:
Small organic molecule
Emp. Form.:
C27H30O3
Mol. Mass.:
402.5253
SMILES:
COc1ccc(cc1C12CC3CC(CC(C3)C1)C2)C(\C)=C\c1ccc(cc1)C(O)=O
: