Target
Retinoic acid receptor beta
Ligand
BDBM50048276
Substrate
Meas. Tech.
ChEMBL_195496 (CHEMBL798917)
Ki
1245±n/a nM
Citation
 Charpentier, BBernardon, JMEustache, JMillois, CMartin, BMichel, SShroot, B Synthesis, structure-affinity relationships, and biological activities of ligands binding to retinoic acid receptor subtypes. J Med Chem 38:4993-5006 (1996)  
Target
Name:
Retinoic acid receptor beta
Synonyms:
HAP NR1B2 RAR-beta RARB Retinoic acid receptor RXR-alpha/Retinoic acid receptor beta Retinoid receptor
Type:
PROTEIN
Mol. Mass.:
50498.70
Organism:
Homo sapiens (Human)
Description:
ChEMBL_1458015
Residue:
455
  
Inhibitor
Name:
BDBM50048276
Synonyms:
4-[(E)-2-(3-Adamantan-1-yl-4-hydroxy-phenyl)-propenyl]-benzoic acid | CHEMBL421773
Type:
Small organic molecule
Emp. Form.:
C26H28O3
Mol. Mass.:
388.4987
SMILES:
C\C(=C/c1ccc(cc1)C(O)=O)c1ccc(O)c(c1)C12CC3CC(CC(C3)C1)C2
: