Target
Retinoic acid receptor alpha
Ligand
BDBM50048296
Substrate
Meas. Tech.
ChEMBL_197413 (CHEMBL799802)
Ki
5.3±n/a nM
Citation
 Charpentier, BBernardon, JMEustache, JMillois, CMartin, BMichel, SShroot, B Synthesis, structure-affinity relationships, and biological activities of ligands binding to retinoic acid receptor subtypes. J Med Chem 38:4993-5006 (1996)  
Target
Name:
Retinoic acid receptor alpha
Synonyms:
NR1B1 RAR-alpha RARA_HUMAN Retinoic acid receptor alpha/Retinoid X receptor alpha Retinoid receptor
Type:
PROTEIN
Mol. Mass.:
50778.87
Organism:
Homo sapiens (Human)
Description:
ChEMBL_1466191
Residue:
462
  
Inhibitor
Name:
BDBM50048296
Synonyms:
4-(5,5,8,8-Tetramethyl-5,6,7,8-tetrahydro-anthracen-2-yl)-benzoic acid | CHEMBL36768
Type:
Small organic molecule
Emp. Form.:
C25H26O2
Mol. Mass.:
358.4727
SMILES:
CC1(C)CCC(C)(C)c2cc3cc(ccc3cc12)-c1ccc(cc1)C(O)=O
: