Target
Glucocorticoid receptor
Ligand
BDBM50499257
Substrate
Meas. Tech.
ChEMBL_1540293 (CHEMBL3739124)
Ki
0.160000±n/a nM
Citation
 Hunt, HJBelanoff, JKGolding, EGourdet, BPhillips, TSwift, DThomas, JUnitt, JFWalters, I 1H-Pyrazolo[3,4-g]hexahydro-isoquinolines as potent GR antagonists with reduced hERG inhibition and an improved pharmacokinetic profile. Bioorg Med Chem Lett 25:5720-5 (2015)  
Target
Name:
Glucocorticoid receptor
Synonyms:
GCR_HUMAN GRL Glucocorticoid receptor (GRFP) Nuclear receptor subfamily 3 group C member 1
Type:
Enzyme
Mol. Mass.:
85656.87
Organism:
Homo sapiens (Human)
Description:
P04150
Residue:
777
  
Inhibitor
Name:
BDBM50499257
Synonyms:
CHEMBL3736457
Type:
Small organic molecule
Emp. Form.:
C27H20F4N4O4S
Mol. Mass.:
572.531
SMILES:
Fc1ccc(cc1)-n1ncc2C[C@@]3(CN(CCC3=Cc12)S(=O)(=O)c1ccc(cc1)C(F)(F)F)C(=O)c1cocn1
: