Target
Alpha-1A/Alpha-1B/Alpha-1D adrenergic receptor
Ligand
BDBM50048600
Substrate
Meas. Tech.
ChEMBL_34008 (CHEMBL643637)
IC50
3300±n/a nM
Citation
 Klein, JTDavis, LOlsen, GEWong, GSHuger, FPSmith, CPPetko, WWCornfeldt, MWilker, JCBlitzer, RDLandau, EHaroutunian, VMartin, LLEffland, RC Synthesis and structure-activity relationships of N-propyl-N-(4-pyridinyl)-1H-indol-1-amine (besipirdine) and related analogs as potential therapeutic agents for Alzheimer's disease. J Med Chem 39:570-81 (1996)  
Target
Name:
Alpha-1A/Alpha-1B/Alpha-1D adrenergic receptor
Synonyms:
Adrenergic receptor alpha-1 alpha-1 Adrenergic Receptor
Type:
Mol. Mass.:
Description:
ASSAY_ID of EBI is 303470
Components:
This complex has 3 components.
Component 1
Name:
Alpha-1B adrenergic receptor
Synonyms:
ADA1B_RAT Alpha 1B-adrenoceptor Alpha adrenergic receptor 1A and 1B Alpha-1Adrenoceptor Alpha-1B adrenoreceptor | adrenergic Alpha1B
Type:
G Protein-Coupled Receptor (GPCR)
Mol. Mass.:
56606.71
Organism:
Rattus norvegicus (rat)
Description:
Receptor binding assays were performed using rat cortical membranes.
Residue:
515
  
Component 2
Name:
Alpha-1A adrenergic receptor
Synonyms:
ADA1A_RAT Adra1c Alpha-1A adrenoceptor Alpha-1C adrenergic receptor | adrenergic Alpha1A
Type:
Protein
Mol. Mass.:
51620.15
Organism:
Rattus norvegicus (Rat)
Description:
P43140
Residue:
466
  
Component 3
Name:
Alpha-1D adrenergic receptor
Synonyms:
ADA1D_RAT Adra1d Alpha-1D adrenergic receptor | Serotonin 1a (5-HT1a) receptor/Adrenergic receptor alpha-1
Type:
Protein
Mol. Mass.:
59375.97
Organism:
Rattus norvegicus (Rat)
Description:
P23944
Residue:
561
  
Inhibitor
Name:
BDBM50048600
Synonyms:
CHEMBL154541 | Ethyl-indol-1-yl-pyridin-4-yl-amine
Type:
Small organic molecule
Emp. Form.:
C15H15N3
Mol. Mass.:
237.2997
SMILES:
CCN(c1ccncc1)n1ccc2ccccc12
: