Target
D(2) dopamine receptor
Ligand
BDBM50007692
Substrate
Meas. Tech.
ChEMBL_62860 (CHEMBL677675)
Ki
2.1±n/a nM
Citation
 Howard, HRLowe, JASeeger, TFSeymour, PAZorn, SHMaloney, PREwing, FENewman, MESchmidt, AWFurman, JSRobinson, GLJackson, EJohnson, CMorrone, J 3-Benzisothiazolylpiperazine derivatives as potential atypical antipsychotic agents. J Med Chem 39:143-8 (1996)  
Target
Name:
D(2) dopamine receptor
Synonyms:
DOPAMINE D2 DOPAMINE D2 Short Dopamine D2 receptor Drd2
Type:
G Protein-Coupled Receptor (GPCR)
Mol. Mass.:
50931.60
Organism:
Rattus norvegicus (rat)
Description:
P61169
Residue:
444
  
Inhibitor
Name:
BDBM50007692
Synonyms:
8-[4-(4-Benzo[d]isothiazol-3-yl-piperazin-1-yl)-butyl]-8-aza-spiro[4.5]decane-7,9-dione CHEMBL35057 | TIOSPERONE
Type:
Small organic molecule
Emp. Form.:
C24H32N4O2S
Mol. Mass.:
440.601
SMILES:
O=C1CC2(CCCC2)CC(=O)N1CCCCN1CCN(CC1)c1nsc2ccccc12
: