Target
Tumor necrosis factor
Ligand
BDBM10850
Substrate
Meas. Tech.
ChEMBL_212395 (CHEMBL873375)
IC50
85000±n/a nM
Citation
 Cottam, HBShih, HTehrani, LRWasson, DBCarson, DA Substituted xanthines, pteridinediones, and related compounds as potential antiinflammatory agents. Synthesis and biological evaluation of inhibitors of tumor necrosis factor alpha. J Med Chem 39:2-9 (1996)  
Target
Name:
Tumor necrosis factor
Synonyms:
Cachectin TNF-a TNFA TNFSF2 Tumor necrosis factor (TNFa) Tumor necrosis factor ligand superfamily member 2 Tumor necrosis factor, soluble form | tumor necrosis factor alpha
Type:
Enzyme
Mol. Mass.:
25645.11
Organism:
Homo sapiens (Human)
Description:
P01375
Residue:
233
  
Inhibitor
Name:
BDBM10850
Synonyms:
1-(5-Oxohexyl)theobromine (pentoxifylline) 3,7-dimethyl-1-(5-oxohexyl)-3,7-dihydropurine-2,6-dione Pentoxifylline Pentoxyphylline
Type:
Small organic molecule
Emp. Form.:
C13H18N4O3
Mol. Mass.:
278.307
SMILES:
CC(=O)CCCCn1c(=O)n(C)c2ncn(C)c2c1=O
: