Target
Prostaglandin G/H synthase 1
Ligand
BDBM50049032
Substrate
Meas. Tech.
ChEMBL_158921 (CHEMBL763485)
IC50
>100000±n/a nM
Citation
 Huang, HCLi, JJGarland, DJChamberlain, TSReinhard, EJManning, RESeibert, KKoboldt, CMGregory, SAAnderson, GDVeenhuizen, AWZhang, YPerkins, WEBurton, EGCogburn, JNIsakson, PCReitz, DB Diarylspiro[2.4]heptenes as orally active, highly selective cyclooxygenase-2 inhibitors: synthesis and structure-activity relationships. J Med Chem 39:253-66 (1996)  
Target
Name:
Prostaglandin G/H synthase 1
Synonyms:
COX-1 Cyclooxygenase Cyclooxygenase-1 (COX-1) PTGS1 | Prostaglandin G/H synthase (cyclooxygenase)
Type:
Enzyme
Mol. Mass.:
68692.62
Organism:
Homo sapiens (Human)
Description:
P23219
Residue:
599
  
Inhibitor
Name:
BDBM50049032
Synonyms:
5-(3-Bromo-4-methoxy-phenyl)-6-(4-methanesulfonyl-phenyl)-spiro[2.4]hept-5-ene | CHEMBL86363
Type:
Small organic molecule
Emp. Form.:
C21H21BrO3S
Mol. Mass.:
433.359
SMILES:
COc1ccc(cc1Br)C1=C(CC2(CC2)C1)c1ccc(cc1)S(C)(=O)=O
: