Target
Prostaglandin G/H synthase 2
Ligand
BDBM50049013
Substrate
Meas. Tech.
ChEMBL_159916 (CHEMBL768965)
IC50
3.3±n/a nM
Citation
 Huang, HCLi, JJGarland, DJChamberlain, TSReinhard, EJManning, RESeibert, KKoboldt, CMGregory, SAAnderson, GDVeenhuizen, AWZhang, YPerkins, WEBurton, EGCogburn, JNIsakson, PCReitz, DB Diarylspiro[2.4]heptenes as orally active, highly selective cyclooxygenase-2 inhibitors: synthesis and structure-activity relationships. J Med Chem 39:253-66 (1996)  
Target
Name:
Prostaglandin G/H synthase 2
Synonyms:
COX2 Cyclooxygenase 2 (COX-2) Cyclooxygenase-2 (COX-2 AA) Cyclooxygenase-2 (COX-2) PGH2_HUMAN PHS II Prostaglandin E synthase/G/H synthase 2 Prostaglandin-endoperoxide synthase 2
Type:
Enzyme
Mol. Mass.:
69003.89
Organism:
Homo sapiens (Human)
Description:
Recombinant Cox-2 provided by Cayman (Cayman Chemical Co.,Ann Arbor, MI).
Residue:
604
  
Inhibitor
Name:
BDBM50049013
Synonyms:
5-(3,4-Difluoro-phenyl)-6-(4-methanesulfonyl-phenyl)-spiro[2.4]hept-5-ene | CHEMBL92107
Type:
Small organic molecule
Emp. Form.:
C20H18F2O2S
Mol. Mass.:
360.418
SMILES:
CS(=O)(=O)c1ccc(cc1)C1=C(CC2(CC2)C1)c1ccc(F)c(F)c1
: