Target
5-hydroxytryptamine receptor 1A
Ligand
BDBM50049099
Substrate
Meas. Tech.
ChEMBL_910 (CHEMBL615759)
Ki
15±n/a nM
Citation
 Glennon, RAHong, SSBondarev, MLaw, HDukat, MRakhi, SPower, PFan, EKinneau, DKamboj, RTeitler, MHerrick-Davis, KSmith, C Binding of O-alkyl derivatives of serotonin at human 5-HT1D beta receptors. J Med Chem 39:314-22 (1996)  
Target
Name:
5-hydroxytryptamine receptor 1A
Synonyms:
5-HT-1A 5-hydroxytryptamine receptor 1A (5-HT-1A) ADRB2RL1 Dopamine D2 receptor and serotonin 1a receptor HTR1A | Serotonin receptor 1A
Type:
Mol. Mass.:
46122.49
Organism:
Homo sapiens (Human)
Description:
Residue:
422
  
Inhibitor
Name:
BDBM50049099
Synonyms:
CHEMBL50492 | [2-(5-Ethyl-1H-indol-3-yl)-ethyl]-dimethyl-amine
Type:
Small organic molecule
Emp. Form.:
C14H20N2
Mol. Mass.:
216.322
SMILES:
CCc1ccc2[nH]cc(CCN(C)C)c2c1
: