Target
Type-1 angiotensin II receptor
Ligand
BDBM50049103
Substrate
Meas. Tech.
ChEMBL_36773 (CHEMBL650295)
IC50
100±n/a nM
Citation
 Yanagisawa, HAmemiya, YKanazaki, TShimoji, YFujimoto, KKitahara, YSada, TMizuno, MIkeda, MMiyamoto, SFurukawa, YKoike, H Nonpeptide angiotensin II receptor antagonists: synthesis, biological activities, and structure-activity relationships of imidazole-5-carboxylic acids bearing alkyl, alkenyl, and hydroxyalkyl substituents at the 4-position and their related compounds. J Med Chem 39:323-38 (1996)  
Target
Name:
Type-1 angiotensin II receptor
Synonyms:
AGTR1 Angiotensin II type 1a (AT-1a) receptor
Type:
PROTEIN
Mol. Mass.:
41107.81
Organism:
Bos taurus
Description:
ChEMBL_36779
Residue:
359
  
Inhibitor
Name:
BDBM50049103
Synonyms:
3-(2'-Carboxy-biphenyl-4-ylmethyl)-5-ethyl-2-propyl-3H-imidazole-4-carboxylic acid | CHEMBL116054
Type:
Small organic molecule
Emp. Form.:
C23H24N2O4
Mol. Mass.:
392.4477
SMILES:
CCCc1nc(CC)c(C(O)=O)n1Cc1ccc(cc1)-c1ccccc1C(O)=O
: