Target
Type-1 angiotensin II receptor
Ligand
BDBM50049119
Substrate
Meas. Tech.
ChEMBL_36773 (CHEMBL650295)
IC50
320±n/a nM
Citation
 Yanagisawa, HAmemiya, YKanazaki, TShimoji, YFujimoto, KKitahara, YSada, TMizuno, MIkeda, MMiyamoto, SFurukawa, YKoike, H Nonpeptide angiotensin II receptor antagonists: synthesis, biological activities, and structure-activity relationships of imidazole-5-carboxylic acids bearing alkyl, alkenyl, and hydroxyalkyl substituents at the 4-position and their related compounds. J Med Chem 39:323-38 (1996)  
Target
Name:
Type-1 angiotensin II receptor
Synonyms:
AGTR1 Angiotensin II type 1a (AT-1a) receptor
Type:
PROTEIN
Mol. Mass.:
41107.81
Organism:
Bos taurus
Description:
ChEMBL_36779
Residue:
359
  
Inhibitor
Name:
BDBM50049119
Synonyms:
1-(2'-Carboxy-biphenyl-4-ylmethyl)-2-propyl-1H-imidazole-4,5-dicarboxylic acid | CHEMBL300186
Type:
Small organic molecule
Emp. Form.:
C22H20N2O6
Mol. Mass.:
408.404
SMILES:
CCCc1nc(C(O)=O)c(C(O)=O)n1Cc1ccc(cc1)-c1ccccc1C(O)=O
: