Target
Protein kinase C alpha type
Ligand
BDBM50049141
Substrate
Meas. Tech.
ChEMBL_160135 (CHEMBL766780)
Ki
13±n/a nM
Citation
 Lee, JSharma, RWang, SMilne, GWLewin, NESzallasi, ZBlumberg, PMGeorge, CMarquez, VE Conformationally constrained analogues of diacylglycerol. 12. Ultrapotent protein kinase C ligands based on a chiral 4,4-disubstituted heptono-1,4-lactone template. J Med Chem 39:36-45 (1996)  
Target
Name:
Protein kinase C alpha type
Synonyms:
KPCA_HUMAN PKC alpha and beta-2 PKC-alpha PRKACA Protein Kinase C- alpha Protein kinase C alpha (PKCa) Protein kinase C alpha type (PRKCA) RAF proto-oncogene serine/threonine-protein kinase
Type:
Enzyme
Mol. Mass.:
76755.65
Organism:
Homo sapiens (Human)
Description:
The recombinant human PKC enzymes were produced using a baculovirus expression system in SF9 cells
Residue:
672
  
Inhibitor
Name:
BDBM50049141
Synonyms:
Acetic acid (R)-2-hydroxymethyl-4-[(Z)-nonadec-10-en-(E)-ylidene]-5-oxo-tetrahydro-furan-2-ylmethyl ester | CHEMBL138351
Type:
Small organic molecule
Emp. Form.:
C27H46O5
Mol. Mass.:
450.6511
SMILES:
CCCCCCCC\C=C/CCCCCCCC\C=C1/C[C@@](CO)(COC(C)=O)OC1=O
: