Target
Delta-type opioid receptor
Ligand
BDBM50049381
Substrate
Meas. Tech.
ChEMBL_147059 (CHEMBL754879)
Ki
15.4±n/a nM
Citation
 Breveglieri, AGuerrini, RSalvadori, SBianchi, CBryant, SDAttila, MLazarus, LH Design and synthesis of 1-aminocycloalkane-1-carboxylic acid-substituted deltorphin analogues: unique delta and mu opioid activity in modified peptides. J Med Chem 39:773-80 (1996)  
Target
Name:
Delta-type opioid receptor
Synonyms:
Cytochrome P450 3A4 Delta opioid receptor Delta-type opioid receptor (DOR) OPRD_RAT Opioid receptor Opioid receptors; mu & delta Ror-a | Voltage-gated potassium channel
Type:
G Protein-Coupled Receptor (GPCR)
Mol. Mass.:
40465.04
Organism:
Rattus norvegicus (rat)
Description:
Competition binding assays were using CHO-K1 cell membranes expressing the opioid receptor.
Residue:
372
  
Inhibitor
Name:
BDBM50049381
Synonyms:
(S)-3-[(1-{(S)-2-[(S)-2-Amino-3-(4-hydroxy-phenyl)-propionylamino]-propionylamino}-cyclopentanecarbonyl)-amino]-N-{(S)-1-[(S)-1-(carbamoylmethyl-carbamoyl)-2-methyl-propylcarbamoyl]-2-methyl-propyl}-succinamic acid | CHEMBL351078
Type:
Small organic molecule
Emp. Form.:
C34H52N8O10
Mol. Mass.:
732.8243
SMILES:
CC(C)[C@H](NC(=O)[C@@H](NC(=O)[C@H](CC(O)=O)NC(=O)C1(CCCC1)NC(=O)[C@H](C)NC(=O)[C@@H](N)Cc1ccc(O)cc1)C(C)C)C(=O)NCC(N)=O
: