Target
Delta-type opioid receptor
Ligand
BDBM50001468
Substrate
Meas. Tech.
ChEMBL_145771 (CHEMBL752789)
IC50
0.46±n/a nM
Citation
 Breveglieri, AGuerrini, RSalvadori, SBianchi, CBryant, SDAttila, MLazarus, LH Design and synthesis of 1-aminocycloalkane-1-carboxylic acid-substituted deltorphin analogues: unique delta and mu opioid activity in modified peptides. J Med Chem 39:773-80 (1996)  
Target
Name:
Delta-type opioid receptor
Synonyms:
DOR-1 MSL-2 OPRD_MOUSE Oprd1
Type:
Enzyme Catalytic Domain
Mol. Mass.:
40577.25
Organism:
MOUSE
Description:
P32300
Residue:
372
  
Inhibitor
Name:
BDBM50001468
Synonyms:
(S)-3-((S)-2-{(R)-2-[(S)-2-Amino-3-(4-hydroxy-phenyl)-propionylamino]-propionylamino}-3-phenyl-propionylamino)-N-{(S)-1-[(S)-1-(carbamoylmethyl-carbamoyl)-2-methyl-propylcarbamoyl]-2-methyl-propyl}-succinamic acid CHEMBL317956 deltorphin C
Type:
Small organic molecule
Emp. Form.:
C37H52N8O10
Mol. Mass.:
768.8564
SMILES:
CC(C)[C@H](NC(=O)[C@@H](NC(=O)[C@H](CC(O)=O)NC(=O)[C@H](Cc1ccccc1)NC(=O)[C@@H](C)NC(=O)[C@@H](N)Cc1ccc(O)cc1)C(C)C)C(=O)NCC(N)=O
: