Target
Adenosine receptor A3
Ligand
BDBM50049384
Substrate
Meas. Tech.
ChEMBL_32014 (CHEMBL649050)
Ki
1210±n/a nM
Citation
 Ji, XDMelman, NJacobson, KA Interactions of flavonoids and other phytochemicals with adenosine receptors. J Med Chem 39:781-8 (1996)  
Target
Name:
Adenosine receptor A3
Synonyms:
A3 adenosine receptor (hA3) ADORA3 | Adenosine A3 receptor (A3AR)
Type:
G Protein-Coupled Receptor (GPCR)
Mol. Mass.:
36197.32
Organism:
Homo sapiens (Human)
Description:
P0DMS8
Residue:
318
  
Inhibitor
Name:
BDBM50049384
Synonyms:
3,5,7-Trimethoxy-2-phenyl-chromen-4-one | CHEMBL75772
Type:
Small organic molecule
Emp. Form.:
C18H16O5
Mol. Mass.:
312.3166
SMILES:
COc1cc(OC)c2c(c1)oc(-c1ccccc1)c(OC)c2=O
: