Target
Adenosine receptor A2a
Ligand
BDBM50049387
Substrate
Meas. Tech.
ChEMBL_31065 (CHEMBL641349)
Ki
35600±n/a nM
Citation
 Ji, XDMelman, NJacobson, KA Interactions of flavonoids and other phytochemicals with adenosine receptors. J Med Chem 39:781-8 (1996)  
Target
Name:
Adenosine receptor A2a
Synonyms:
AA2AR_RAT Adenosine A2 receptor Adenosine Receptors A2a (A2a) Adenosine receptors A2a Rat striatal adenosine A2a receptor
Type:
G Protein-Coupled Receptor (GPCR)
Mol. Mass.:
45015.65
Organism:
Rattus norvegicus (rat)
Description:
Rat A2A receptors expressed in CHO cells.
Residue:
410
  
Inhibitor
Name:
BDBM50049387
Synonyms:
5,4'-Dihydroxy-7-o-methoxyflavanone 5-hydroxy-2-(4-hydroxyphenyl)-7-methoxychroman-4-one NSC-407228
Type:
Small organic molecule
Emp. Form.:
C16H14O5
Mol. Mass.:
286.2794
SMILES:
COc1cc(O)c2C(=O)CC(Oc2c1)c1ccc(O)cc1
: