Target
Dihydrofolate reductase
Ligand
BDBM50049608
Substrate
Meas. Tech.
ChEMBL_52843 (CHEMBL665047)
IC50
1000±n/a nM
Citation
 Gangjee, AZhu, YQueener, SFFrancom, PBroom, AD Nonclassical 2,4-diamino-8-deazafolate analogues as inhibitors of dihydrofolate reductases from rat liver, Pneumocystis carinii, and Toxoplasma gondii. J Med Chem 39:1836-45 (1996)  
Target
Name:
Dihydrofolate reductase
Synonyms:
DFR1 | DYR_YEAST
Type:
PROTEIN
Mol. Mass.:
24263.24
Organism:
Saccharomyces cerevisiae
Description:
ChEMBL_52843
Residue:
211
  
Inhibitor
Name:
BDBM50049608
Synonyms:
6-[(2,6-Dichloro-phenylamino)-methyl]-pyrido[3,2-d]pyrimidine-2,4-diamine | CHEMBL54913
Type:
Small organic molecule
Emp. Form.:
C14H12Cl2N6
Mol. Mass.:
335.191
SMILES:
Nc1nc(N)c2nc(CNc3c(Cl)cccc3Cl)ccc2n1
: