Target
Dihydrofolate reductase
Ligand
BDBM50049603
Substrate
Meas. Tech.
ChEMBL_52843 (CHEMBL665047)
IC50
160±n/a nM
Citation
 Gangjee, AZhu, YQueener, SFFrancom, PBroom, AD Nonclassical 2,4-diamino-8-deazafolate analogues as inhibitors of dihydrofolate reductases from rat liver, Pneumocystis carinii, and Toxoplasma gondii. J Med Chem 39:1836-45 (1996)  
Target
Name:
Dihydrofolate reductase
Synonyms:
DFR1 | DYR_YEAST
Type:
PROTEIN
Mol. Mass.:
24263.24
Organism:
Saccharomyces cerevisiae
Description:
ChEMBL_52843
Residue:
211
  
Inhibitor
Name:
BDBM50049603
Synonyms:
6-{[(2,4-Dimethoxy-phenyl)-methyl-amino]-methyl}-pyrido[3,2-d]pyrimidine-2,4-diamine | CHEMBL299174
Type:
Small organic molecule
Emp. Form.:
C17H20N6O2
Mol. Mass.:
340.3797
SMILES:
COc1ccc(N(C)Cc2ccc3nc(N)nc(N)c3n2)c(OC)c1
: