Target
Dihydrofolate reductase
Ligand
BDBM18224
Substrate
Meas. Tech.
ChEMBL_52843 (CHEMBL665047)
IC50
31±n/a nM
Citation
 Gangjee, AZhu, YQueener, SFFrancom, PBroom, AD Nonclassical 2,4-diamino-8-deazafolate analogues as inhibitors of dihydrofolate reductases from rat liver, Pneumocystis carinii, and Toxoplasma gondii. J Med Chem 39:1836-45 (1996)  
Target
Name:
Dihydrofolate reductase
Synonyms:
DFR1 | DYR_YEAST
Type:
PROTEIN
Mol. Mass.:
24263.24
Organism:
Saccharomyces cerevisiae
Description:
ChEMBL_52843
Residue:
211
  
Inhibitor
Name:
BDBM18224
Synonyms:
6-[(2,5-dimethoxyphenyl)methyl]-5-methylpyrido[2,3-d]pyrimidine-2,4-diamine PTX [2-amino-6-(2,5-dimethoxybenzyl)-5-methyl-pyrido[2,3-d]pyrimidin-4-yl]amine;2-hydroxyethanesulfonic acid
Type:
Small organic molecule
Emp. Form.:
C17H19N5O2
Mol. Mass.:
325.3651
SMILES:
COc1ccc(OC)c(Cc2cnc3nc(N)nc(N)c3c2C)c1
: