Target
Dihydrofolate reductase
Ligand
BDBM18268
Substrate
Meas. Tech.
ChEMBL_55116 (CHEMBL884367)
IC50
3±n/a nM
Citation
 Gangjee, AZhu, YQueener, SFFrancom, PBroom, AD Nonclassical 2,4-diamino-8-deazafolate analogues as inhibitors of dihydrofolate reductases from rat liver, Pneumocystis carinii, and Toxoplasma gondii. J Med Chem 39:1836-45 (1996)  
Target
Name:
Dihydrofolate reductase
Synonyms:
DYR_RAT Dihydrofolate reductase (DHFR) Tetrahydrofolate dehydrogenase
Type:
Enzyme
Mol. Mass.:
21638.84
Organism:
Rattus norvegicus (rat)
Description:
Residue:
187
  
Inhibitor
Name:
BDBM18268
Synonyms:
5-methyl-6-{[(3,4,5-trimethoxyphenyl)amino]methyl}quinazoline-2,4-diamine TMQ US11111252, Compound TMQ | US11530198, Example Trimetrexate
Type:
Small organic molecule
Emp. Form.:
C19H23N5O3
Mol. Mass.:
369.4176
SMILES:
COc1cc(NCc2ccc3nc(N)nc(N)c3c2C)cc(OC)c1OC
: