Target
Dihydrofolate reductase
Ligand
BDBM50049607
Substrate
Meas. Tech.
ChEMBL_52843 (CHEMBL665047)
IC50
97±n/a nM
Citation
 Gangjee, AZhu, YQueener, SFFrancom, PBroom, AD Nonclassical 2,4-diamino-8-deazafolate analogues as inhibitors of dihydrofolate reductases from rat liver, Pneumocystis carinii, and Toxoplasma gondii. J Med Chem 39:1836-45 (1996)  
Target
Name:
Dihydrofolate reductase
Synonyms:
DFR1 | DYR_YEAST
Type:
PROTEIN
Mol. Mass.:
24263.24
Organism:
Saccharomyces cerevisiae
Description:
ChEMBL_52843
Residue:
211
  
Inhibitor
Name:
BDBM50049607
Synonyms:
6-{[(3-Methoxy-phenyl)-methyl-amino]-methyl}-pyrido[3,2-d]pyrimidine-2,4-diamine | CHEMBL54792
Type:
Small organic molecule
Emp. Form.:
C16H18N6O
Mol. Mass.:
310.3537
SMILES:
COc1cccc(c1)N(C)Cc1ccc2nc(N)nc(N)c2n1
: