Target
Bifunctional dihydrofolate reductase-thymidylate synthase
Ligand
BDBM50049581
Substrate
Meas. Tech.
ChEMBL_53319 (CHEMBL665702)
IC50
130±n/a nM
Citation
 Gangjee, AZhu, YQueener, SFFrancom, PBroom, AD Nonclassical 2,4-diamino-8-deazafolate analogues as inhibitors of dihydrofolate reductases from rat liver, Pneumocystis carinii, and Toxoplasma gondii. J Med Chem 39:1836-45 (1996)  
Target
Name:
Bifunctional dihydrofolate reductase-thymidylate synthase
Synonyms:
DHFR-TS Dihydrofolate reductase Dihydrofolate reductase; T. gondii vs rat
Type:
Enzyme
Mol. Mass.:
68757.49
Organism:
Toxoplasma gondii
Description:
Q07422
Residue:
610
  
Inhibitor
Name:
BDBM50049581
Synonyms:
6-Phenylsulfanylmethyl-pyrido[3,2-d]pyrimidine-2,4-diamine | CHEMBL300886
Type:
Small organic molecule
Emp. Form.:
C14H13N5S
Mol. Mass.:
283.352
SMILES:
Nc1nc(N)c2nc(CSc3ccccc3)ccc2n1
: