Target
Dihydrofolate reductase
Ligand
BDBM50031867
Substrate
Meas. Tech.
ChEMBL_52843 (CHEMBL665047)
IC50
130±n/a nM
Citation
 Gangjee, AZhu, YQueener, SFFrancom, PBroom, AD Nonclassical 2,4-diamino-8-deazafolate analogues as inhibitors of dihydrofolate reductases from rat liver, Pneumocystis carinii, and Toxoplasma gondii. J Med Chem 39:1836-45 (1996)  
Target
Name:
Dihydrofolate reductase
Synonyms:
DFR1 | DYR_YEAST
Type:
PROTEIN
Mol. Mass.:
24263.24
Organism:
Saccharomyces cerevisiae
Description:
ChEMBL_52843
Residue:
211
  
Inhibitor
Name:
BDBM50031867
Synonyms:
6-((methyl(3,4,5-trimethoxyphenyl)amino)methyl)pyrido[3,2-d]pyrimidine-2,4-diamine CHEMBL52688
Type:
Small organic molecule
Emp. Form.:
C18H22N6O3
Mol. Mass.:
370.4057
SMILES:
COc1cc(cc(OC)c1OC)N(C)Cc1ccc2nc(N)nc(N)c2n1
: