Target
Bifunctional dihydrofolate reductase-thymidylate synthase
Ligand
BDBM50049590
Substrate
Meas. Tech.
ChEMBL_53319 (CHEMBL665702)
IC50
46±n/a nM
Citation
 Gangjee, AZhu, YQueener, SFFrancom, PBroom, AD Nonclassical 2,4-diamino-8-deazafolate analogues as inhibitors of dihydrofolate reductases from rat liver, Pneumocystis carinii, and Toxoplasma gondii. J Med Chem 39:1836-45 (1996)  
Target
Name:
Bifunctional dihydrofolate reductase-thymidylate synthase
Synonyms:
DHFR-TS Dihydrofolate reductase Dihydrofolate reductase; T. gondii vs rat
Type:
Enzyme
Mol. Mass.:
68757.49
Organism:
Toxoplasma gondii
Description:
Q07422
Residue:
610
  
Inhibitor
Name:
BDBM50049590
Synonyms:
1-{4-[(2,4-Diamino-pyrido[3,2-d]pyrimidin-6-ylmethyl)-methyl-amino]-phenyl}-2,2,2-trifluoro-ethanone | CHEMBL55049
Type:
Small organic molecule
Emp. Form.:
C17H15F3N6O
Mol. Mass.:
376.3358
SMILES:
CN(Cc1ccc2nc(N)nc(N)c2n1)c1ccc(cc1)C(=O)C(F)(F)F
: