Target
Delta-type opioid receptor
Ligand
BDBM50049801
Substrate
Meas. Tech.
ChEMBL_147023 (CHEMBL753664)
Ki
>1000±n/a nM
Citation
 Cappelli, AAnzini, MVomero, SMenziani, MCDe Benedetti, PGSbacchi, MClarke, GDMennuni, L Synthesis, biological evaluation, and quantitative receptor docking simulations of 2-[(acylamino)ethyl]-1,4-benzodiazepines as novel tifluadom-like ligands with high affinity and selectivity for kappa-opioid receptors. J Med Chem 39:860-72 (1996)  
Target
Name:
Delta-type opioid receptor
Synonyms:
D-OR-1 Delta opioid receptor OPIATE Delta OPRD1 OPRK1 | opioid receptor, delta 1
Type:
G Protein-Coupled Receptor (GPCR)
Mol. Mass.:
40382.98
Organism:
Homo sapiens (Human)
Description:
Competition binding assays were carried out using membrane preparations from transfected HN9.10 cells that constitutively expressed the delta opioid receptor.
Residue:
372
  
Inhibitor
Name:
BDBM50049801
Synonyms:
4-Chloro-N-[2-(7-chloro-1-methyl-5-phenyl-2,3-dihydro-1H-benzo[e][1,4]diazepin-2-yl)-ethyl]-benzamide | CHEMBL340001
Type:
Small organic molecule
Emp. Form.:
C25H23Cl2N3O
Mol. Mass.:
452.376
SMILES:
CN1C(CCNC(=O)c2ccc(Cl)cc2)CN=C(c2ccccc2)c2cc(Cl)ccc12
: