Target
Gastrin/cholecystokinin type B receptor
Ligand
BDBM50049803
Substrate
Meas. Tech.
ChEMBL_48098 (CHEMBL663085)
Ki
17000±n/a nM
Citation
 Cappelli, AAnzini, MVomero, SMenziani, MCDe Benedetti, PGSbacchi, MClarke, GDMennuni, L Synthesis, biological evaluation, and quantitative receptor docking simulations of 2-[(acylamino)ethyl]-1,4-benzodiazepines as novel tifluadom-like ligands with high affinity and selectivity for kappa-opioid receptors. J Med Chem 39:860-72 (1996)  
Target
Name:
Gastrin/cholecystokinin type B receptor
Synonyms:
CCK-2 receptor CCK-BR CCKRB Cholecystokinin receptor GASR_HUMAN | Gastrin/cholecystokinin type B receptor
Type:
G Protein-Coupled Receptor (GPCR)
Mol. Mass.:
48445.79
Organism:
Homo sapiens (Human)
Description:
Stable expression of human CCK-2 receptors in HEK 293 cells.
Residue:
447
  
Inhibitor
Name:
BDBM50049803
Synonyms:
CHEMBL124015 | Thiophene-2-carboxylic acid [2-(7-chloro-1-methyl-5-phenyl-2,3-dihydro-1H-benzo[e][1,4]diazepin-2-yl)-ethyl]-amide
Type:
Small organic molecule
Emp. Form.:
C23H22ClN3OS
Mol. Mass.:
423.958
SMILES:
CN1C(CCNC(=O)c2cccs2)CN=C(c2ccccc2)c2cc(Cl)ccc12
: